{"text_format":"1","workbook":"xlsx","n_sheets":4,"sheets":["Instructions","Stakeholder Inputs","Configuration","Chart Data"],"not_rendered":{"charts":1,"images":2,"macros":1,"external_links":0,"defined_names":22,"comments":0,"pivot_tables":0},"unopened":[],"bounds":{"document_bytes":16777216,"sheet_cells":100000,"rows_first":2000,"rows_last":500,"rows_between":2000,"halvings":0,"cell_chars":16384,"cell_head_chars":4096},"cells_cut":0,"cells_raw":0,"read":"whole","date_system":"1900"}

{"sheet":"Instructions","index":0,"n_rows":41,"n_cols":2,"rows_kept":41,"cut":false,"hidden":false,"merged":[]}
[]
[null,"This tool was originally developed by the United States Agency for International Development (USAID). This 2018 version was produced for review by USAID. It was prepared by the LEARN mechanism out of the USAID Learning, Evaluation and Research (LER) Office in the Bureau of Policy, Planning and Learning (PPL). LEARN is managed by Dexis Consulting Group."]
[]
[null,"Collaboration Mapping Worksheet Instructions"]
[null,"You can use this worksheet offline by downloading it from Learning Lab (http://usaidlearninglab.org/library/collaboration-mapping ) and saving it to your computer. For the automated features to work properly, make sure you enable macros. As you input each stakeholder and their associated data on the Stakeholder Input tab, the collaboration map in that tab will automatically update ."]
[null,"Step 1: Title and Logo"]
[null,"Give your map a title by filling out the ‘Title’ field. That title will automatically appear on your map."]
[null,"If you would like to use a logo different from the default USAID logo, click on the logo, and on the ‘Chart Tools/Format’ menu tab, select the ‘Shape Fill’ option from the Shape Styles area. Choose the ‘Picture’ option near the bottom of the Shape Fill drop-down menu and browse for the image file you would like to use instead. It will be cropped to a circle the same size as the default USAID logo."]
[null,"Step 2: Organization Categories"]
[null,"In the worksheet section marked ‘Organization Quadrant Setup,’ type the four types of organizations in the ‘Name’ column, replacing the I, II, III, and IV. This could be U.S. Government, Host Country Institutions, Implementing Partners, Academic/Civil Society, Other Donors, etc., depending on the nature of your collaboration map. If you want them to appear in particular quadrants on the map, align your labels with the ‘Location’ column (Upper Right, Upper Left, etc.). Once you identify the labels for the organizational type quadrants, these will appear on the drop-down menu in the collaboration mapping template below in the ‘Type of Organization’ column."]
[null,"Step 3: Stakeholder/Relationship Dimensions"]
[null,"In the worksheet section marked 'Stakeholder/Relationship Dimensions,' you can customize the map from the default dimensions of strength of interaction, and resource- and non-resource-based influence. Replace the default labels to change the type of information you wish to capture. For example, for a communications initiative, you might want to identify stakeholders' current understanding/awareness of an issue. For a change management initiative, you can consider capturing the level of impact the change could have on the stakeholder."]
[null,"Step 4: Stakeholders"]
[null,"In the collaboration mapping template section, list your stakeholders in the ‘Stakeholder Name’ column."]
[null,"This name will be automatically copied to the ‘Custom Data Label’ column and serve as the stakeholder’s circle label in your collaboration map. If you would like to use a shortened name or acronym in your collaboration map, you can simply type the custom label you prefer in the ‘Custom Data Label’ column. "]
[null,"Step 5: Quadrant Placement"]
[null,"For each stakeholder you have listed, identify which ‘Type of Organization’ best fits them in the next column. Double-click on the cell (or click the small arrow button to the right of the cell) to show the drop-down menu of labels you chose in step 2. By selecting one of the four options, the circle for the stakeholder will be placed in the appropriate quadrant of your map."]
[null,"Step 6-8: Stakeholder/Relationship Dimension Information"]
[null,"For each of the three stakeholder/relationship dimensions you chose in Step 3, provide a numeric determination of the value on a scale of 1-10 for each stakeholder."]
[null,"• Dimension 1 (Default: Current Interaction/Relationship Strength): This will determine the circle’s proximity to the center of the map. The higher the number, the closer the circle will be to the center.\n• Dimension 2 (Default: Resource-based Influence): This will determine the circle’s relative size. The higher the number, the larger the circle.\n• Dimension 3 (Default: Non-resource-based Influence): This will determine how light or dark the circle color is. The higher the number, the darker the circle’s color fill."]
[null,"Please note: The lines/arrows described in the Facilitation Guide (page 6, available on Learning Lab) that represent interaction characteristics and financial flows are not automated and will need to be inserted manually if you wish to include them. Copy and paste your completed collaboration map to a new document and use the insert function to add your lines/arrows. If you do not choose to include these, you can incorporate both the frequency and the quality of the interaction/relationship with each stakeholder when you determine your 1-10 ranking for this value."]
[null,"The relative scale of the circles to one another and the map overall can be adjusted with the ‘Bubble Scale’ option below the map or on the Configuration tab."]
[null,"Step 9: Priority"]
[null,"By selecting the checkbox in the ‘Priority’ column, you can indicate if a particular stakeholder is a priority for collaboration. This will be indicated by a glow effect around the circle."]
[null,"Step 10: Relative Positioning"]
[null,"Due to relative size and random placement of the circles, they may occasionally overlap one other. You can re-order a circle by clicking on its cell in the Custom Data Label column and then clicking the ‘To Top’ or ‘To Bottom’ buttons. The ‘Reset Order’ button will reset the layer order to the default with the stakeholders’ circles displayed from bottom to top in the order than are entered into the table (e.g., Stakeholder #1 is the bottommost circle)."]
[null,"You can also adjust a circle’s position within its quadrant without changing the value of Dimension 1 (e.g., Current Interaction/Relationship Strength) by using the ‘Adjust Position’ sliders. This might be useful if you want to indicate that a particular stakeholder is closer to one neighboring quadrant than other. For example, if an NGO has very close ties with local universities, its circle would be in the NGO quadrant, but you can move it relatively closer to the adjacent Academia quadrant."]
[null,"You can also use the ‘Adjust Position’ sliders to move stakeholders closer or farther apart from one another to give a more accurate picture of the overall stakeholder relationships rather than simply their relationship to the center. Moving the slider to the right adjusts the circle clockwise; to the left adjusts the circle counterclockwise. The ‘Clear’ button will reset all of the sliders to the beginning of each quadrant when adjusting it clockwise (all the way to the right on the slider). The ‘Randomize’ button will assign random values to each circle’s position, which can then be refined using the individual sliders."]
[null,"The offset controls in the ‘Logo Size and Offset’ box under the map allow you to adjust the proximity to the central logo and the stakeholder circles.  Use this to increase the distance between the central logo and stakeholder circles that have a high relationship strength (closer to the circle) and/or high financial influence (larger circle) and would otherwise overlap with the central logo."]
[null,"Similarly, the ‘Axis Scale’ options under the map allow you to adjust the axis value for the quadrants.  This allows for customization when there are stakeholders with low relationship strength (further from the central logo) and their circles would be cut off the map. Press ‘increase’ to bring the stakeholder circles relatively closer to the central logo. Conversely, if you would like to increase the distance between the circles and spread them out further from the central logo, press ‘decrease.’"]
{"$rows_left_out":12}
{"sheet":"Stakeholder Inputs","index":1,"n_rows":211,"n_cols":21,"rows_kept":211,"cut":false,"hidden":false,"merged":[[1,4,1,7],[8,1,8,5],[24,12,24,14],[24,20,24,22],[3,5,3,7],[4,5,4,7],[5,5,5,7]]}
[null,"Organization Quadrant Setup ",null,null,"Title"]
[null,"Location","Name",null,"Title"]
[null,"(Upper Right)","I",null,"Stakeholder/Relationship Dimensions",null,null,null,1]
[null,"(Upper Left)","II",null,"Dimension 1","Current Interaction/ Relationship Strength",null,null,2]
[null,"(Lower Left)","III",null,"Dimension 2","Resource-based Influence",null,null,3]
[null,"(Lower Right)","IV",null,"Dimension 3","Non-resource-based Influence",null,null,4]
[]
[]
[null,"Collaboration Mapping Template"]
["Number","Stakeholder Name","Type of Organization",{"$f":"Configuration_Label_Scale1&CHAR(10)&\"(1-10)\"","v":"Current Interaction/ Relationship Strength\n(1-10)"},{"$f":"Configuration_Label_Scale2&CHAR(10)&\"(1-10)\"","v":"Resource-based Influence\n(1-10)"},{"$f":"Configuration_Label_Scale3&CHAR(10)&\"(1-10)\"","v":"Non-resource-based Influence\n(1-10)"},"Priority\n(Yes/No)","Custom Data Label",null,null,"Adjust Position\n× Counterclockwise - Clockwise Ø"]
[null,null,null,"1 = Low = Farther Out\n10 = High = Closer In","​​1​ ​=​ ​Low= Smaller Circle\n​ 10 = High = Larger Circle","​1​ ​=​ ​Low= Lighter Color\n​ 10 = High = Darker Color","Yes indicates glow"]
[1,null,null,null,null,null,null,{"$f":"B12","v":0},false,{"$f":"I12","v":false}]
[2,null,null,null,null,null,null,0,false,{"$f":"I13","v":false}]
[3,null,null,null,null,null,null,0,false,false]
[4,null,null,null,null,null,null,0,false,false]
[5,null,null,null,null,null,null,0,false,false]
[6,null,null,null,null,null,null,0,false,false]
[7,null,null,null,null,null,null,0,false,false]
[8,null,null,null,null,null,null,0,false,false]
[9,null,null,null,null,null,null,0,false,false]
[10,null,null,null,null,null,null,0,false,false]
[11,null,null,null,null,null,null,0,false,false]
[12,null,null,null,null,null,null,0,false,false]
[13,null,null,null,null,null,null,0,false,false]
[14,null,null,null,null,null,null,0,false,false,null,null,"Logo Size and Offset",null,null,null,null,"Circle Scale",null,null,"Axis Scale"]
[15,null,null,null,null,null,null,0,false,false]
[16,null,null,null,null,null,null,0,false,false]
[17,null,null,null,null,null,null,0,false,false]
[18,null,null,null,null,null,null,0,false,false]
[19,null,null,null,null,null,null,0,false,false]
{"$rows_left_out":182}
{"sheet":"Configuration","index":2,"n_rows":34,"n_cols":12,"rows_kept":34,"cut":false,"hidden":false,"merged":[[5,1,5,2]]}
[]
[null,"Configuration Options"]
[]
[]
[]
[null,"Dimension 3 Shading Color Palette",null,null,null,"Aqua","Grey","Green","Blue","Tan","Red","Custom"]
[null,1,"Label",null,null,"Label","Label","Label","Label","Label","Label"]
[null,2,"Label",null,null,"Label","Label","Label","Label","Label","Label"]
[null,3,"Label",null,null,"Label","Label","Label","Label","Label","Label"]
[null,4,"Label",null,null,"Label","Label","Label","Label","Label","Label"]
[null,5,"Label",null,null,"Label","Label","Label","Label","Label","Label"]
[null,6,"Label",null,null,"Label","Label","Label","Label","Label","Label"]
[null,7,"Label",null,null,"Label","Label","Label","Label","Label","Label"]
[null,8,"Label",null,null,"Label","Label","Label","Label","Label","Label"]
[null,9,"Label",null,null,"Label","Label","Label","Label","Label","Label"]
[null,10,"Label",null,null,"Label","Label","Label","Label","Label","Label"]
[]
[]
[]
[null,"Glow Color"]
[null,"Glow Radius",5]
[]
[null,"Logo Offset",3]
[]
[null,"Logo Size",4]
[]
[null,"Logo on Top",null,null,true]
[]
[null,"Axis Size",15]
[]
{"$rows_left_out":5}
{"sheet":"Chart Data","index":3,"n_rows":211,"n_cols":21,"rows_kept":211,"cut":false,"hidden":true,"merged":[]}
[1,0,90]
[2,90,180]
[3,180,270]
[4,270,360]
[]
[]
["Chart Data"]
[null,null,null,null,null,null,null,null,null,null,null,null,null,null,null,null,null,null,"Adjustment"]
["SeriesName","Original Series Number","Organization Name","Type of Organization","Current Interaction \nRelationship Strength\n(1-10)","Financial influence \n(1-10)","Non-financial Influence \n(1-10)","Priority","Distance","Name","X","Y","Size","Color","Glow","Quadrant","Angle from Origin (Degrees)","Angle from Origin (Radians)","Angle offset within Quadrant (0-90)","Angle Adjustment","Data Label"]
["Max",1,null,null,null,null,null,null,null,"Max Bubble",0,0,10]
["USAID",2,null,null,null,null,null,null,null,"USAID Logo",0,0,{"$f":"configuration_logosize","v":4}]
[1,3,{"$f":"'Stakeholder Inputs'!B12","v":0},{"$f":"'Stakeholder Inputs'!C12","v":0},{"$f":"'Stakeholder Inputs'!D12","v":0},{"$f":"'Stakeholder Inputs'!E12","v":0},{"$f":"'Stakeholder Inputs'!F12","v":0},{"$f":"'Stakeholder Inputs'!I12","v":false},{"$f":"(10-E12+configuration_distanceoffset)","v":13},{"$f":"C12","v":0},{"$f":"I12*COS(R12)","v":13},{"$f":"I12*SIN(R12)","v":0},{"$f":"F12","v":0},{"$f":"G12","v":0},{"$f":"H12","v":false},{"$f":"IFERROR(VLOOKUP(D12,table_quadrants_number,7,FALSE),0)","v":0},{"$f":"IFERROR(VLOOKUP(P12,table_quadrants_angles,2,FALSE)+S12,0)","v":0},{"$f":"RADIANS(Q12)","v":0},{"$f":"90-T12","v":26},64,{"$f":"IF('Stakeholder Inputs'!H12<>0,'Stakeholder Inputs'!H12,\"\")","v":""}]
[2,4,{"$f":"'Stakeholder Inputs'!B13","v":0},{"$f":"'Stakeholder Inputs'!C13","v":0},{"$f":"'Stakeholder Inputs'!D13","v":0},{"$f":"'Stakeholder Inputs'!E13","v":0},{"$f":"'Stakeholder Inputs'!F13","v":0},{"$f":"'Stakeholder Inputs'!I13","v":false},13,{"$f":"C13","v":0},{"$f":"I13*COS(R13)","v":13},{"$f":"I13*SIN(R13)","v":0},{"$f":"F13","v":0},{"$f":"G13","v":0},{"$f":"H13","v":false},0,0,{"$f":"RADIANS(Q13)","v":0},{"$f":"90-T13","v":42},48,{"$f":"IF('Stakeholder Inputs'!H13<>0,'Stakeholder Inputs'!H13,\"\")","v":""}]
[3,5,{"$f":"'Stakeholder Inputs'!B14","v":0},{"$f":"'Stakeholder Inputs'!C14","v":0},{"$f":"'Stakeholder Inputs'!D14","v":0},{"$f":"'Stakeholder Inputs'!E14","v":0},{"$f":"'Stakeholder Inputs'!F14","v":0},{"$f":"'Stakeholder Inputs'!I14","v":false},13,0,13,0,0,0,false,0,0,0,38,52,{"$f":"IF('Stakeholder Inputs'!H14<>0,'Stakeholder Inputs'!H14,\"\")","v":""}]
[4,6,{"$f":"'Stakeholder Inputs'!B15","v":0},{"$f":"'Stakeholder Inputs'!C15","v":0},{"$f":"'Stakeholder Inputs'!D15","v":0},{"$f":"'Stakeholder Inputs'!E15","v":0},{"$f":"'Stakeholder Inputs'!F15","v":0},{"$f":"'Stakeholder Inputs'!I15","v":false},13,0,13,0,0,0,false,0,0,0,64,26,{"$f":"IF('Stakeholder Inputs'!H15<>0,'Stakeholder Inputs'!H15,\"\")","v":""}]
[5,7,{"$f":"'Stakeholder Inputs'!B16","v":0},{"$f":"'Stakeholder Inputs'!C16","v":0},{"$f":"'Stakeholder Inputs'!D16","v":0},{"$f":"'Stakeholder Inputs'!E16","v":0},{"$f":"'Stakeholder Inputs'!F16","v":0},{"$f":"'Stakeholder Inputs'!I16","v":false},13,0,13,0,0,0,false,0,0,0,63,27,{"$f":"IF('Stakeholder Inputs'!H16<>0,'Stakeholder Inputs'!H16,\"\")","v":""}]
[6,8,{"$f":"'Stakeholder Inputs'!B17","v":0},{"$f":"'Stakeholder Inputs'!C17","v":0},{"$f":"'Stakeholder Inputs'!D17","v":0},{"$f":"'Stakeholder Inputs'!E17","v":0},{"$f":"'Stakeholder Inputs'!F17","v":0},{"$f":"'Stakeholder Inputs'!I17","v":false},13,0,13,0,0,0,false,0,0,0,20,70,{"$f":"IF('Stakeholder Inputs'!H17<>0,'Stakeholder Inputs'!H17,\"\")","v":""}]
[7,9,{"$f":"'Stakeholder Inputs'!B18","v":0},{"$f":"'Stakeholder Inputs'!C18","v":0},{"$f":"'Stakeholder Inputs'!D18","v":0},{"$f":"'Stakeholder Inputs'!E18","v":0},{"$f":"'Stakeholder Inputs'!F18","v":0},{"$f":"'Stakeholder Inputs'!I18","v":false},13,0,13,0,0,0,false,0,0,0,89,1,{"$f":"IF('Stakeholder Inputs'!H18<>0,'Stakeholder Inputs'!H18,\"\")","v":""}]
[8,10,{"$f":"'Stakeholder Inputs'!B19","v":0},{"$f":"'Stakeholder Inputs'!C19","v":0},{"$f":"'Stakeholder Inputs'!D19","v":0},{"$f":"'Stakeholder Inputs'!E19","v":0},{"$f":"'Stakeholder Inputs'!F19","v":0},{"$f":"'Stakeholder Inputs'!I19","v":false},13,0,13,0,0,0,false,0,0,0,21,69,{"$f":"IF('Stakeholder Inputs'!H19<>0,'Stakeholder Inputs'!H19,\"\")","v":""}]
[9,11,{"$f":"'Stakeholder Inputs'!B20","v":0},{"$f":"'Stakeholder Inputs'!C20","v":0},{"$f":"'Stakeholder Inputs'!D20","v":0},{"$f":"'Stakeholder Inputs'!E20","v":0},{"$f":"'Stakeholder Inputs'!F20","v":0},{"$f":"'Stakeholder Inputs'!I20","v":false},13,0,13,0,0,0,false,0,0,0,16,74,{"$f":"IF('Stakeholder Inputs'!H20<>0,'Stakeholder Inputs'!H20,\"\")","v":""}]
[10,12,{"$f":"'Stakeholder Inputs'!B21","v":0},{"$f":"'Stakeholder Inputs'!C21","v":0},{"$f":"'Stakeholder Inputs'!D21","v":0},{"$f":"'Stakeholder Inputs'!E21","v":0},{"$f":"'Stakeholder Inputs'!F21","v":0},{"$f":"'Stakeholder Inputs'!I21","v":false},13,0,13,0,0,0,false,0,0,0,26,64,{"$f":"IF('Stakeholder Inputs'!H21<>0,'Stakeholder Inputs'!H21,\"\")","v":""}]
[11,13,{"$f":"'Stakeholder Inputs'!B22","v":0},{"$f":"'Stakeholder Inputs'!C22","v":0},{"$f":"'Stakeholder Inputs'!D22","v":0},{"$f":"'Stakeholder Inputs'!E22","v":0},{"$f":"'Stakeholder Inputs'!F22","v":0},{"$f":"'Stakeholder Inputs'!I22","v":false},13,0,13,0,0,0,false,0,0,0,86,4,{"$f":"IF('Stakeholder Inputs'!H22<>0,'Stakeholder Inputs'!H22,\"\")","v":""}]
[12,14,{"$f":"'Stakeholder Inputs'!B23","v":0},{"$f":"'Stakeholder Inputs'!C23","v":0},{"$f":"'Stakeholder Inputs'!D23","v":0},{"$f":"'Stakeholder Inputs'!E23","v":0},{"$f":"'Stakeholder Inputs'!F23","v":0},{"$f":"'Stakeholder Inputs'!I23","v":false},13,0,13,0,0,0,false,0,0,0,53,37,{"$f":"IF('Stakeholder Inputs'!H23<>0,'Stakeholder Inputs'!H23,\"\")","v":""}]
[13,15,{"$f":"'Stakeholder Inputs'!B24","v":0},{"$f":"'Stakeholder Inputs'!C24","v":0},{"$f":"'Stakeholder Inputs'!D24","v":0},{"$f":"'Stakeholder Inputs'!E24","v":0},{"$f":"'Stakeholder Inputs'!F24","v":0},{"$f":"'Stakeholder Inputs'!I24","v":false},13,0,13,0,0,0,false,0,0,0,12,78,{"$f":"IF('Stakeholder Inputs'!H24<>0,'Stakeholder Inputs'!H24,\"\")","v":""}]
[14,16,{"$f":"'Stakeholder Inputs'!B25","v":0},{"$f":"'Stakeholder Inputs'!C25","v":0},{"$f":"'Stakeholder Inputs'!D25","v":0},{"$f":"'Stakeholder Inputs'!E25","v":0},{"$f":"'Stakeholder Inputs'!F25","v":0},{"$f":"'Stakeholder Inputs'!I25","v":false},13,0,13,0,0,0,false,0,0,0,19,71,{"$f":"IF('Stakeholder Inputs'!H25<>0,'Stakeholder Inputs'!H25,\"\")","v":""}]
[15,17,{"$f":"'Stakeholder Inputs'!B26","v":0},{"$f":"'Stakeholder Inputs'!C26","v":0},{"$f":"'Stakeholder Inputs'!D26","v":0},{"$f":"'Stakeholder Inputs'!E26","v":0},{"$f":"'Stakeholder Inputs'!F26","v":0},{"$f":"'Stakeholder Inputs'!I26","v":false},13,0,13,0,0,0,false,0,0,0,57,33,{"$f":"IF('Stakeholder Inputs'!H26<>0,'Stakeholder Inputs'!H26,\"\")","v":""}]
[16,18,{"$f":"'Stakeholder Inputs'!B27","v":0},{"$f":"'Stakeholder Inputs'!C27","v":0},{"$f":"'Stakeholder Inputs'!D27","v":0},{"$f":"'Stakeholder Inputs'!E27","v":0},{"$f":"'Stakeholder Inputs'!F27","v":0},{"$f":"'Stakeholder Inputs'!I27","v":false},13,0,13,0,0,0,false,0,0,0,3,87,{"$f":"IF('Stakeholder Inputs'!H27<>0,'Stakeholder Inputs'!H27,\"\")","v":""}]
[17,19,{"$f":"'Stakeholder Inputs'!B28","v":0},{"$f":"'Stakeholder Inputs'!C28","v":0},{"$f":"'Stakeholder Inputs'!D28","v":0},{"$f":"'Stakeholder Inputs'!E28","v":0},{"$f":"'Stakeholder Inputs'!F28","v":0},{"$f":"'Stakeholder Inputs'!I28","v":false},13,0,13,0,0,0,false,0,0,0,11,79,{"$f":"IF('Stakeholder Inputs'!H28<>0,'Stakeholder Inputs'!H28,\"\")","v":""}]
[18,20,{"$f":"'Stakeholder Inputs'!B29","v":0},{"$f":"'Stakeholder Inputs'!C29","v":0},{"$f":"'Stakeholder Inputs'!D29","v":0},{"$f":"'Stakeholder Inputs'!E29","v":0},{"$f":"'Stakeholder Inputs'!F29","v":0},{"$f":"'Stakeholder Inputs'!I29","v":false},13,0,13,0,0,0,false,0,0,0,85,5,{"$f":"IF('Stakeholder Inputs'!H29<>0,'Stakeholder Inputs'!H29,\"\")","v":""}]
[19,21,{"$f":"'Stakeholder Inputs'!B30","v":0},{"$f":"'Stakeholder Inputs'!C30","v":0},{"$f":"'Stakeholder Inputs'!D30","v":0},{"$f":"'Stakeholder Inputs'!E30","v":0},{"$f":"'Stakeholder Inputs'!F30","v":0},{"$f":"'Stakeholder Inputs'!I30","v":false},13,0,13,0,0,0,false,0,0,0,4,86,{"$f":"IF('Stakeholder Inputs'!H30<>0,'Stakeholder Inputs'!H30,\"\")","v":""}]
{"$rows_left_out":181}